BDBM50412782 CHEMBL493697
SMILES COc1cccc(OC)c1OCCNC[C@@H]1COCC(O1)(c1ccccc1)c1ccccc1
InChI Key InChIKey=MFUWMPKHVOQTMZ-HSZRJFAPSA-N
Data  9 KI
  Tab Delimited (TSV)   2D SDfile   Computed 3D by Vconf -m prep SDfile
Find this compound or compounds like it in BindingDB:
Activity Spreadsheet -- Enzyme Inhibition Constant Data from BindingDB
Found 9 hits for monomerid = 50412782
Target5-hydroxytryptamine receptor 1A(Homo sapiens (Human))
Universit£
Curated by ChEMBL
LigandPNGBDBM50412782(CHEMBL493697)
Affinity DataKi:  1.41nM. Assay description: Displacement of [3H]8-OH-DPAT from human cloned 5HT1A receptor expressed in human HeLa cells
In DepthDetails ArticlePubMed
Target5-hydroxytryptamine receptor 1A(Homo sapiens (Human))
Universit£
Curated by ChEMBL
LigandPNGBDBM50412782(CHEMBL493697)
Affinity DataKi:  45nM. Assay description: Displacement of [3H]8-OH-DPAT from human recombinant 5HT1A receptor expressed in HeLa cell membranes after 30 mins
In DepthDetails ArticlePubMed
Target5-hydroxytryptamine receptor 1A(Homo sapiens (Human))
Universit£
Curated by ChEMBL
LigandPNGBDBM50412782(CHEMBL493697)
Affinity DataKi:  45nM. Assay description: Displacement of [3H]8-OH-DPAT from recombinant human 5HT1A receptor expressed in human HeLa cell membranes after 30 mins by liquid scintillation coun...
In DepthDetails ArticlePubMed
TargetAlpha-1D adrenergic receptor(Homo sapiens (Human))
University Of Camerino
Curated by ChEMBL
LigandPNGBDBM50412782(CHEMBL493697)
Affinity DataKi:  56nM. Assay description: Displacement of [3H]prazosin from human recombinant alpha1D adrenergic receptor expressed in CHO cell membranes after 30 mins
In DepthDetails ArticlePubMed
TargetAlpha-1D adrenergic receptor(Homo sapiens (Human))
University Of Camerino
Curated by ChEMBL
LigandPNGBDBM50412782(CHEMBL493697)
Affinity DataKi:  66.1nM. Assay description: Displacement of [3H]prazosin from human cloned alpha1D adrenoceptor expressed in CHO cells
In DepthDetails ArticlePubMed
TargetAlpha-1A adrenergic receptor(Homo sapiens (Human))
University Of Camerino
Curated by ChEMBL
LigandPNGBDBM50412782(CHEMBL493697)
Affinity DataKi:  166nM. Assay description: Displacement of [3H]prazosin from human recombinant alpha1A adrenergic receptor expressed in CHO cell membranes after 30 mins
In DepthDetails ArticlePubMed
TargetAlpha-1B adrenergic receptor(Homo sapiens (Human))
University Of Camerino
Curated by ChEMBL
LigandPNGBDBM50412782(CHEMBL493697)
Affinity DataKi:  195nM. Assay description: Displacement of [3H]prazosin from human recombinant alpha1B adrenergic receptor expressed in CHO cell membranes after 30 mins
In DepthDetails ArticlePubMed
TargetAlpha-1B adrenergic receptor(Homo sapiens (Human))
University Of Camerino
Curated by ChEMBL
LigandPNGBDBM50412782(CHEMBL493697)
Affinity DataKi:  324nM. Assay description: Displacement of [3H]prazosin from human cloned Alpha-1B adrenoreceptor expressed in CHO cells
In DepthDetails ArticlePubMed
TargetAlpha-1A adrenergic receptor(Homo sapiens (Human))
University Of Camerino
Curated by ChEMBL
LigandPNGBDBM50412782(CHEMBL493697)
Affinity DataKi:  339nM. Assay description: Displacement of [3H]prazosin from human cloned alpha1A adrenoceptor expressed in CHO cells
In DepthDetails ArticlePubMed