BDBM50414427 CHEMBL560650
SMILES Clc1ccc(CN2CCN(CCN3Cc4ccccc4C3)C2=O)cc1Cl
InChI Key InChIKey=OJGCUCNESMAFSG-UHFFFAOYSA-N
Data  2 KI  1 IC50
  Tab Delimited (TSV)   2D SDfile   Computed 3D by Vconf -m prep SDfile
Find this compound or compounds like it in BindingDB:
Activity Spreadsheet -- Enzyme Inhibition Constant Data from BindingDB
Found 3 hits for monomerid = 50414427
TargetD(3) dopamine receptor(Homo sapiens (Human))
Glaxosmithkline
Curated by ChEMBL
LigandPNGBDBM50414427(CHEMBL560650)
Affinity DataKi:  79.4nM. Assay description: Antagonist activity at human dopamine D3 receptor expressed in CHO cells by [35S]GTP-gamma-S-based scintillation spectrometry
In DepthDetails ArticlePubMed
TargetD(2) dopamine receptor(Homo sapiens (Human))
Glaxosmithkline
Curated by ChEMBL
LigandPNGBDBM50414427(CHEMBL560650)
Affinity DataKi: >1.00E+4nM. Assay description: Antagonist activity at human dopamine D2 receptor expressed in CHO cells by [35S]GTP-gamma-S-based scintillation spectrometry
In DepthDetails ArticlePubMed
TargetPotassium voltage-gated channel subfamily H member 2(Homo sapiens (Human))
Glaxosmithkline
Curated by ChEMBL
LigandPNGBDBM50414427(CHEMBL560650)
Affinity DataIC50:  794nM. Assay description: Displacement of [3H]dofetilide from human ERG channel by scintillation proximity assay
In DepthDetails ArticlePubMed