BDBM50416313 CHEMBL1170305
SMILES Cc1c(nc2ccccc2c1C(=O)N[C@H](C1CC1)c1cccc(F)c1)-c1ccccc1
InChI Key InChIKey=ZTYSMOMJVIYXJW-AREMUKBSSA-N
Data  1 IC50
  Tab Delimited (TSV)   2D SDfile   Computed 3D by Vconf -m prep SDfile
Find this compound or compounds like it in BindingDB:
Activity Spreadsheet -- Enzyme Inhibition Constant Data from BindingDB
Found 1 hit for monomerid = 50416313
TargetCytochrome P450 2C9(Homo sapiens (Human))
Glaxosmithkline
Curated by ChEMBL
LigandPNGBDBM50416313(CHEMBL1170305)
Affinity DataIC50:  7.94E+3nM. Assay description: Inhibition of CYP2C9
In DepthDetails ArticlePubMed