BDBM50417165 CHEMBL1271119
SMILES Fc1ccc(cc1)C(=O)OCCCCSc1nnc(o1)-c1cccc2ccccc12
InChI Key InChIKey=XZHPZPGALCXJHG-UHFFFAOYSA-N
Data  1 KI
  Tab Delimited (TSV)   2D SDfile   Computed 3D by Vconf -m prep SDfile
Find this compound or compounds like it in BindingDB:
Activity Spreadsheet -- Enzyme Inhibition Constant Data from BindingDB
Found 1 hit for monomerid = 50417165
TargetPolyunsaturated fatty acid lipoxygenase ALOX15(Homo sapiens (Human))
National Human Genome Research Institute
Curated by ChEMBL
LigandPNGBDBM50417165(CHEMBL1271119)
Affinity DataKi:  600nM. Assay description: Inhibition of human N-terminal His6-tagged reticulocyte 15-lipoxygenase-1 catalytic site assessed as 15-HPETE formation by Michaelis-Menten equation ...
In DepthDetails ArticlePubMed