BDBM50417168 CHEMBL1271323
SMILES OCC#CCSc1nnc(o1)-c1cccc2ccccc12
InChI Key InChIKey=NPBWOHGXTXQHGH-UHFFFAOYSA-N
Data  1 KI
  Tab Delimited (TSV)   2D SDfile   Computed 3D by Vconf -m prep SDfile
Find this compound or compounds like it in BindingDB:
Activity Spreadsheet -- Enzyme Inhibition Constant Data from BindingDB
Found 1 hit for monomerid = 50417168
TargetPolyunsaturated fatty acid lipoxygenase ALOX15(Homo sapiens (Human))
National Human Genome Research Institute
Curated by ChEMBL
LigandPNGBDBM50417168(CHEMBL1271323)
Affinity DataKi:  3.50E+3nM. Assay description: Inhibition of human N-terminal His6-tagged reticulocyte 15-lipoxygenase-1 catalytic site assessed as 15-HPETE formation by Michaelis-Menten equation ...
In DepthDetails ArticlePubMed