BDBM50417479 CHEMBL1288078
SMILES CC(C)(C(=O)Nc1ccc(N2CCC(CC2)N2CCCCC2)c(Cl)c1)c1cccc(c1)C(F)(F)F
InChI Key InChIKey=BPGOSRQFTCQNCB-UHFFFAOYSA-N
Data  1 KI
  Tab Delimited (TSV)   2D SDfile   Computed 3D by Vconf -m prep SDfile
Find this compound or compounds like it in BindingDB:
Activity Spreadsheet -- Enzyme Inhibition Constant Data from BindingDB
Found 1 hit for monomerid = 50417479
TargetNeuropeptide Y receptor type 2(Homo sapiens (Human))
Glaxosmithkline
Curated by ChEMBL
LigandPNGBDBM50417479(CHEMBL1288078)
Affinity DataKi:  15.8nM. Assay description: Antagonist activity at human NPY Y2 receptor in KAN-TS cells by [35]GTPgammaS assay
In DepthDetails ArticlePubMed