BDBM50418450 CHEMBL1783250
SMILES CCCNC(=O)c1nnc2c(cccc2c1N)-c1ccccc1C
InChI Key InChIKey=JMRHVJPVNLBGRZ-UHFFFAOYSA-N
Data  1 KI
  Tab Delimited (TSV)   2D SDfile   Computed 3D by Vconf -m prep SDfile
Find this compound or compounds like it in BindingDB:
Activity Spreadsheet -- Enzyme Inhibition Constant Data from BindingDB
Found 1 hit for monomerid = 50418450
TargetGABA-A receptor; alpha-2/beta-3/gamma-2(Homo sapiens (Human))
Astrazeneca
Curated by ChEMBL
LigandPNGBDBM50418450(CHEMBL1783250)
Affinity DataKi:  1.95nM. Assay description: Displacement of [3H]flunitrazepam from benzodiazepine binding site GABAA alpha2beta3gamma2 receptor expressed in Sf9 cells after 1 hr
In DepthDetails ArticlePubMed