BDBM50418480 CHEMBL1783280
SMILES CCCNC(=O)c1nnc2c(cccc2c1N)-c1cnccc1OC
InChI Key InChIKey=VHGIDFXNMYWNMX-UHFFFAOYSA-N
Data  2 KI
  Tab Delimited (TSV)   2D SDfile   Computed 3D by Vconf -m prep SDfile
Find this compound or compounds like it in BindingDB:
Activity Spreadsheet -- Enzyme Inhibition Constant Data from BindingDB
Found 2 hits for monomerid = 50418480
TargetGamma-aminobutyric acid receptor subunit alpha-2(Homo sapiens (Human))
University Of Sussex
Curated by ChEMBL
LigandPNGBDBM50418480(CHEMBL1783280)
Affinity DataKi:  2.20nM. Assay description: Binding affinity to GABA-A alpha2 (unknown origin)
In DepthDetails ArticlePubMed
TargetGABA-A receptor; alpha-2/beta-3/gamma-2(Homo sapiens (Human))
Astrazeneca
Curated by ChEMBL
LigandPNGBDBM50418480(CHEMBL1783280)
Affinity DataKi:  2.24nM. Assay description: Displacement of [3H]flunitrazepam from benzodiazepine binding site GABAA alpha2beta3gamma2 receptor expressed in Sf9 cells after 1 hr
In DepthDetails ArticlePubMed