BDBM50419312 CHEMBL1835862
SMILES Cc1cc(CCCCOCCCCCCNC[C@H](O)c2ccc(O)c(CO)c2)cc(NC(N)=O)c1
InChI Key InChIKey=DBESJEGRRAZRSW-SANMLTNESA-N
Data  4 EC50
  Tab Delimited (TSV)   2D SDfile   Computed 3D by Vconf -m prep SDfile
Find this compound or compounds like it in BindingDB:
Activity Spreadsheet -- Enzyme Inhibition Constant Data from BindingDB
Found 4 hits for monomerid = 50419312
TargetBeta-2 adrenergic receptor(Homo sapiens (Human))
Glaxosmithkline
Curated by ChEMBL
LigandPNGBDBM50419312(CHEMBL1835862)
Affinity DataEC50:  0.158nM. Assay description: Agonist activity at human beta2 receptor expressed in CHO cells assessed as cAMP accumulation
In DepthDetails ArticlePubMed
TargetBeta-2 adrenergic receptor(GUINEA PIG)
Glaxosmithkline
Curated by ChEMBL
LigandPNGBDBM50419312(CHEMBL1835862)
Affinity DataEC50:  1.60nM. Assay description: Agonist activity at beta2 adrenergic receptor in guinea pig tracheal strip assessed as inhibition of electrically-induced bronchocontractile response
In DepthDetails ArticlePubMed
TargetBeta-3 adrenergic receptor(Homo sapiens (Human))
Glaxosmithkline
Curated by ChEMBL
LigandPNGBDBM50419312(CHEMBL1835862)
Affinity DataEC50:  40nM. Assay description: Agonist activity at human beta3 receptor expressed in CHO cells assessed as cAMP accumulation
In DepthDetails ArticlePubMed
TargetBeta-1 adrenergic receptor(Homo sapiens (Human))
Glaxosmithkline
Curated by ChEMBL
LigandPNGBDBM50419312(CHEMBL1835862)
Affinity DataEC50:  40nM. Assay description: Agonist activity at human beta1 receptor expressed in CHO cells assessed as cAMP accumulation
In DepthDetails ArticlePubMed