BDBM50419322 CHEMBL1910386
SMILES Fc1ccc(Cn2c(NC3CCN(CCN4CCN(CC4)C(=O)c4cc5ccccc5[nH]4)CC3)nc3ccccc23)cc1
InChI Key InChIKey=LLBZLFNYOYVBFX-UHFFFAOYSA-N
Data  2 KI  1 Kd
  Tab Delimited (TSV)   2D SDfile   Computed 3D by Vconf -m prep SDfile
Find this compound or compounds like it in BindingDB:
Activity Spreadsheet -- Enzyme Inhibition Constant Data from BindingDB
Found 2 hits for monomerid = 50419322
TargetHistamine H1 receptor(Homo sapiens (Human))
University Of Regensburg
Curated by ChEMBL
LigandPNGBDBM50419322(CHEMBL1910386)
Affinity DataKi:  5.5nM. Assay description: Displacement of [3H]mepyramine from human H1R expressed in Sf9 cells co-expressing RGS4 after 90 mins by liquid scintillation counting
In DepthDetails ArticlePubMed
TargetHistamine H4 receptor(Homo sapiens (Human))
University Of Regensburg
Curated by ChEMBL
LigandPNGBDBM50419322(CHEMBL1910386)
Affinity DataKi:  1.05E+4nM. Assay description: Displacement of [3H]histamine from human H4R expressed in Sf9 cells co-expressing RGS19, Galphai2 and Gbeta1gamma2 after 60 mins by liquid scintillat...
In DepthDetails ArticlePubMed