BDBM50419346 CHEMBL1917035
SMILES C(NCc1nnnn1C1CCCCC1)C(c1ccccc1)c1ccccc1
InChI Key InChIKey=UMPFRWYVFFKJMQ-UHFFFAOYSA-N
Data  1 IC50
  Tab Delimited (TSV)   2D SDfile   Computed 3D by Vconf -m prep SDfile
Find this compound or compounds like it in BindingDB:
Activity Spreadsheet -- Enzyme Inhibition Constant Data from BindingDB
Found 1 hit for monomerid = 50419346
TargetSodium- and chloride-dependent GABA transporter 3(Mus musculus)
Ludwig-Maximilians-University Munich
Curated by ChEMBL
LigandPNGBDBM50419346(CHEMBL1917035)
Affinity DataIC50:  4.27E+4nM. Assay description: Inhibition of mouse GAT3-mediated [3H]GABA uptake expressed in human HEK cells
In DepthDetails ArticlePubMed