BDBM50420223 CHEMBL2074971
SMILES COc1ccc(CCNCCCC(C#N)(C(C)C)c2cc(OC)c(OC)c(OC)c2)cc1OC
InChI Key InChIKey=JBERDSXBGRTWOG-UHFFFAOYSA-N
Data  3 IC50
  Tab Delimited (TSV)   2D SDfile   Computed 3D by Vconf -m prep SDfile
Find this compound or compounds like it in BindingDB:
Activity Spreadsheet -- Enzyme Inhibition Constant Data from BindingDB
Found 3 hits for monomerid = 50420223
TargetATP-dependent translocase ABCB1(Homo sapiens (Human))
Schering-Plough Research Institute
Curated by ChEMBL
LigandPNGBDBM50420223(CHEMBL2074971)
Affinity DataIC50:  4.90E+3nM. Assay description: TP_TRANSPORTER: inhibition of LDS-751 efflux in NIH-3T3-G185 cells
In DepthDetails ArticlePubMed
TargetATP-dependent translocase ABCB1(Homo sapiens (Human))
Schering-Plough Research Institute
Curated by ChEMBL
LigandPNGBDBM50420223(CHEMBL2074971)
Affinity DataIC50:  8.60E+3nM. Assay description: TP_TRANSPORTER: inhibition of Rhodamine 123 efflux in NIH-3T3-G185 cells
In DepthDetails ArticlePubMed
TargetATP-dependent translocase ABCB1(Homo sapiens (Human))
Schering-Plough Research Institute
Curated by ChEMBL
LigandPNGBDBM50420223(CHEMBL2074971)
Affinity DataIC50:  3.60E+3nM. Assay description: TP_TRANSPORTER: inhibition of Daunorubicin efflux in NIH-3T3-G185 cells
In DepthDetails ArticlePubMed