BDBM50420311 CHEMBL2089114
SMILES Cc1c(Cl)cccc1Cn1c(CO)nc(=O)c2sc(nc12)N1CCOCC1
InChI Key InChIKey=VCAGBYZINBCVJR-UHFFFAOYSA-N
Data  4 IC50  1 EC50
  Tab Delimited (TSV)   2D SDfile   Computed 3D by Vconf -m prep SDfile
Find this compound or compounds like it in BindingDB:
Activity Spreadsheet -- Enzyme Inhibition Constant Data from BindingDB
Found 5 hits for monomerid = 50420311
LigandPNGBDBM50420311(CHEMBL2089114)
Affinity DataEC50:  6nM. Assay description: Inhibition of PI3K beta in human PTEN-deficient MDA-MB-468 cells assessed as inhibition of Akt Ser473 phosphorylation
In DepthDetails ArticlePubMed
LigandPNGBDBM50420311(CHEMBL2089114)
Affinity DataIC50:  250nM. Assay description: Inhibition of PI3K gamma by continuous TR-FRET assay
In DepthDetails ArticlePubMed
LigandPNGBDBM50420311(CHEMBL2089114)
Affinity DataIC50:  500nM. Assay description: Inhibition of PI3K alpha by continuous TR-FRET assay
In DepthDetails ArticlePubMed
LigandPNGBDBM50420311(CHEMBL2089114)
Affinity DataIC50:  0.100nM. Assay description: Inhibition of PI3K beta by continuous TR-FRET assay
In DepthDetails ArticlePubMed
LigandPNGBDBM50420311(CHEMBL2089114)
Affinity DataIC50:  2nM. Assay description: Inhibition of PI3K delta by continuous TR-FRET assay
In DepthDetails ArticlePubMed