BDBM50421766 CHEMBL3142335::CHEMBL74682
SMILES COC(=O)C[C@H](O)[C@H](CC(C)C)NC(=O)[C@H](C)NC(=O)C[C@H](O)[C@H](CC(C)C)NC(=O)[C@H](CCSC)NC(=O)[C@H](Cc1ccccc1)NC(=O)OC(C)(C)C
InChI Key InChIKey=LKQSVTHZCZBLTM-UHFFFAOYSA-N
Data  1 IC50
  Tab Delimited (TSV)   2D SDfile   Computed 3D by Vconf -m prep SDfile
Find this compound or compounds like it in BindingDB:
Activity Spreadsheet -- Enzyme Inhibition Constant Data from BindingDB
Found 1 hit for monomerid = 50421766
TargetRenin(Homo sapiens (Human))
Sanofi Recherche
Curated by ChEMBL
LigandPNGBDBM50421766(CHEMBL3142335 | CHEMBL74682)
Affinity DataIC50:  316nM. Assay description: Inhibition of human plasma renin
In DepthDetails ArticlePubMed