BDBM50421767 CHEMBL312075::CHEMBL3142324
SMILES COC(=O)C[C@H](O)[C@H](CC(C)C)NC(=O)[C@H](C)NC(=O)C[C@H](O)[C@H](CC(C)C)NC(=O)C(NC(=O)[C@H](Cc1ccccc1)NC(=O)OC(C)(C)C)C1CCCCC1
InChI Key InChIKey=ASPCWFGSNWXDNM-UHFFFAOYSA-N
Data  1 IC50
  Tab Delimited (TSV)   2D SDfile   Computed 3D by Vconf -m prep SDfile
Find this compound or compounds like it in BindingDB:
Activity Spreadsheet -- Enzyme Inhibition Constant Data from BindingDB
Found 1 hit for monomerid = 50421767
TargetRenin(Homo sapiens (Human))
Sanofi Recherche
Curated by ChEMBL
LigandPNGBDBM50421767(CHEMBL312075 | CHEMBL3142324)
Affinity DataIC50:  151nM. Assay description: Inhibition of human plasma renin
In DepthDetails ArticlePubMed