BDBM50421768 CHEMBL3142319::CHEMBL75987
SMILES CCC[C@H](NC(=O)[C@H](Cc1ccccc1)NC(C)=O)C(=O)N[C@@H](CC(C)C)[C@@H](O)CC(=O)N[C@@H](C)C(=O)N[C@@H](CC(C)C)[C@@H](O)CC(=O)OC
InChI Key InChIKey=HHJOADGWAKXNFR-UHFFFAOYSA-N
Data  1 IC50
  Tab Delimited (TSV)   2D SDfile   Computed 3D by Vconf -m prep SDfile
Find this compound or compounds like it in BindingDB:
Activity Spreadsheet -- Enzyme Inhibition Constant Data from BindingDB
Found 1 hit for monomerid = 50421768
TargetRenin(Homo sapiens (Human))
Sanofi Recherche
Curated by ChEMBL
LigandPNGBDBM50421768(CHEMBL3142319 | CHEMBL75987)
Affinity DataIC50:  257nM. Assay description: Inhibition of human plasma renin
In DepthDetails ArticlePubMed