BDBM50421772 CHEMBL3142323::CHEMBL75470
SMILES COC(=O)C[C@H](O)[C@H](CC(C)C)NC(=O)[C@H](C)NC(=O)C[C@H](O)[C@H](CC(C)C)NC(=O)C(NC(=O)[C@H](Cc1ccccc1)NC(=O)OC(C)(C)C)c1cccs1
InChI Key InChIKey=GRQGOTDUULJPEJ-UHFFFAOYSA-N
Data  1 IC50
  Tab Delimited (TSV)   2D SDfile   Computed 3D by Vconf -m prep SDfile
Find this compound or compounds like it in BindingDB:
Activity Spreadsheet -- Enzyme Inhibition Constant Data from BindingDB
Found 1 hit for monomerid = 50421772
TargetRenin(Homo sapiens (Human))
Sanofi Recherche
Curated by ChEMBL
LigandPNGBDBM50421772(CHEMBL3142323 | CHEMBL75470)
Affinity DataIC50:  251nM. Assay description: Inhibition of human plasma renin
In DepthDetails ArticlePubMed