BDBM50422455 CHEMBL98476
SMILES CCCCc1cnc(NC(P(O)(O)=O)P(O)(O)=O)s1
InChI Key InChIKey=IPUSMGHNRFCXKP-UHFFFAOYSA-N
Data  1 IC50
  Tab Delimited (TSV)   2D SDfile   Computed 3D by Vconf -m prep SDfile
Find this compound or compounds like it in BindingDB:
Activity Spreadsheet -- Enzyme Inhibition Constant Data from BindingDB
Found 1 hit for monomerid = 50422455
TargetFarnesyl pyrophosphate synthase(Homo sapiens (Human))
University Of Illinois At Urbana-Champaign
Curated by ChEMBL
LigandPNGBDBM50422455(CHEMBL98476)
Affinity DataIC50:  2.70nM. Assay description: Negative logarithm of inhibitory concentration against bone resorption
In DepthDetails ArticlePubMed