BDBM50422461 CHEMBL100335
SMILES Cc1cnc(NC(P(O)(O)=O)P(O)(O)=O)s1
InChI Key InChIKey=RMVOBMKURSHNFJ-UHFFFAOYSA-N
Data  1 IC50
  Tab Delimited (TSV)   2D SDfile   Computed 3D by Vconf -m prep SDfile
Find this compound or compounds like it in BindingDB:
Activity Spreadsheet -- Enzyme Inhibition Constant Data from BindingDB
Found 1 hit for monomerid = 50422461
TargetFarnesyl pyrophosphate synthase(Homo sapiens (Human))
University Of Illinois At Urbana-Champaign
Curated by ChEMBL
LigandPNGBDBM50422461(CHEMBL100335)
Affinity DataIC50:  5.10nM. Assay description: Negative logarithm of inhibitory concentration against bone resorption
In DepthDetails ArticlePubMed