BDBM50423888 CHEMBL2312414
SMILES CCCCCCCCNC(=O)C(=C\c1cn(CC(O)CN(C)C)c2ccccc12)\C#N
InChI Key InChIKey=HRFWBDGUUMUKRE-HMMYKYKNSA-N
Data  1 IC50
  Tab Delimited (TSV)   2D SDfile   Computed 3D by Vconf -m prep SDfile
Find this compound or compounds like it in BindingDB:
Activity Spreadsheet -- Enzyme Inhibition Constant Data from BindingDB
Found 1 hit for monomerid = 50423888
TargetDynamin-2(Homo sapiens (Human))
The University Of Newcastle
Curated by ChEMBL
LigandPNGBDBM50423888(CHEMBL2312414)
Affinity DataIC50:  3.50E+3nM. Assay description: Inhibition of dyn2 in human U2OS cells assessed as clathrin-mediated endocytosis of Tfn after 30 mins
In DepthDetails ArticlePubMed