BDBM50424114 CHEMBL2315675
SMILES Cc1ccccc1CN1CCC(CC1)N1CCC(C(F)C1)n1c2ccccc2[nH]c1=O
InChI Key InChIKey=UVNVDXZOLDWJKU-UHFFFAOYSA-N
Data  2 KI  9 IC50
  Tab Delimited (TSV)   2D SDfile   Computed 3D by Vconf -m prep SDfile
Find this compound or compounds like it in BindingDB:
Activity Spreadsheet -- Enzyme Inhibition Constant Data from BindingDB
Found 11 hits for monomerid = 50424114
TargetMuscarinic acetylcholine receptor M1(RAT)
Vanderbilt University Medical Center
Curated by ChEMBL
LigandPNGBDBM50424114(CHEMBL2315675)
Affinity DataKi:  1.35E+3nM. Assay description: Displacement of [3H]NMS from rat muscarinic M1 receptor expressed in CHO cells after 3 hrs
In DepthDetails ArticlePubMed
TargetMuscarinic acetylcholine receptor M1(RAT)
Vanderbilt University Medical Center
Curated by ChEMBL
LigandPNGBDBM50424114(CHEMBL2315675)
Affinity DataKi:  1.35E+3nM. Assay description: Displacement of [3H]NMS from rat muscarinic M1 receptor expressed in CHO cells after 3 hrs
In DepthDetails ArticlePubMed
TargetMuscarinic acetylcholine receptor M5(RAT)
Vanderbilt University Medical Center
Curated by ChEMBL
LigandPNGBDBM50424114(CHEMBL2315675)
Affinity DataIC50: >1.00E+4nM. Assay description: Antagonist activity at rat muscarinic M5 receptor expressed in CHO cells assessed as inhibition of Ach-induced calcium response
In DepthDetails ArticlePubMed
TargetMuscarinic acetylcholine receptor M1(RAT)
Vanderbilt University Medical Center
Curated by ChEMBL
LigandPNGBDBM50424114(CHEMBL2315675)
Affinity DataIC50:  4.90E+3nM. Assay description: Antagonist activity at rat muscarinic M1 receptor expressed in CHO cells assessed as inhibition of Ach-induced calcium response
In DepthDetails ArticlePubMed
TargetMuscarinic acetylcholine receptor M3(RAT)
Vanderbilt University Medical Center
Curated by ChEMBL
LigandPNGBDBM50424114(CHEMBL2315675)
Affinity DataIC50: >1.00E+4nM. Assay description: Antagonist activity at rat muscarinic M3 receptor expressed in CHO cells assessed as inhibition of Ach-induced calcium response
In DepthDetails ArticlePubMed
TargetMuscarinic acetylcholine receptor M2(RAT)
Vanderbilt University Medical Center
Curated by ChEMBL
LigandPNGBDBM50424114(CHEMBL2315675)
Affinity DataIC50: >1.00E+4nM. Assay description: Antagonist activity at rat muscarinic M2 receptor expressed in CHO cells assessed as inhibition of Ach-induced calcium response
In DepthDetails ArticlePubMed
TargetMuscarinic acetylcholine receptor M5(RAT)
Vanderbilt University Medical Center
Curated by ChEMBL
LigandPNGBDBM50424114(CHEMBL2315675)
Affinity DataIC50: >1.00E+4nM. Assay description: Antagonist activity at rat muscarinic M5 receptor expressed in CHO cells assessed as inhibition of Ach-induced calcium response
In DepthDetails ArticlePubMed
TargetMuscarinic acetylcholine receptor M3(RAT)
Vanderbilt University Medical Center
Curated by ChEMBL
LigandPNGBDBM50424114(CHEMBL2315675)
Affinity DataIC50: >1.00E+4nM. Assay description: Antagonist activity at rat muscarinic M3 receptor expressed in CHO cells assessed as inhibition of Ach-induced calcium response
In DepthDetails ArticlePubMed
TargetMuscarinic acetylcholine receptor M4(RAT)
Vanderbilt University Medical Center
Curated by ChEMBL
LigandPNGBDBM50424114(CHEMBL2315675)
Affinity DataIC50:  5.20E+3nM. Assay description: Antagonist activity at rat muscarinic M4 receptor expressed in CHO cells assessed as inhibition of Ach-induced calcium response
In DepthDetails ArticlePubMed
TargetMuscarinic acetylcholine receptor M4(RAT)
Vanderbilt University Medical Center
Curated by ChEMBL
LigandPNGBDBM50424114(CHEMBL2315675)
Affinity DataIC50:  5.20E+3nM. Assay description: Antagonist activity at rat muscarinic M4 receptor expressed in CHO cells assessed as inhibition of Ach-induced calcium response
In DepthDetails ArticlePubMed
TargetMuscarinic acetylcholine receptor M2(RAT)
Vanderbilt University Medical Center
Curated by ChEMBL
LigandPNGBDBM50424114(CHEMBL2315675)
Affinity DataIC50: >1.00E+4nM. Assay description: Antagonist activity at rat muscarinic M2 receptor expressed in CHO cells assessed as inhibition of Ach-induced calcium response
In DepthDetails ArticlePubMed