BDBM50426180 CHEMBL2311928
SMILES C[C@@H](O)[C@H](N)C(=O)NS(=O)(=O)c1cccc(c1)-c1ccc2C(=O)NCc2c1
InChI Key InChIKey=DWJGNVFDIJMANO-HWPZZCPQSA-N
Data  2 KI
  Tab Delimited (TSV)   2D SDfile   Computed 3D by Vconf -m prep SDfile
Find this compound or compounds like it in BindingDB:
Activity Spreadsheet -- Enzyme Inhibition Constant Data from BindingDB
Found 2 hits for monomerid = 50426180
TargetThreonine--tRNA ligase(Yersinia pestis)
Trius Therapeutics
Curated by ChEMBL
LigandPNGBDBM50426180(CHEMBL2311928)
Affinity DataKi:  3.90nM. Assay description: Binding affinity to Yersinia pestis ThrRS by coupled spectrophotometry
In DepthDetails ArticlePubMed
TargetThreonine--tRNA ligase 1, cytoplasmic(Homo sapiens (Human))
Trius Therapeutics
Curated by ChEMBL
LigandPNGBDBM50426180(CHEMBL2311928)
Affinity DataKi:  91nM. Assay description: Binding affinity to human cytoplasmic ThrRS by coupled spectrophotometry
In DepthDetails ArticlePubMed