BDBM50427704 CHEMBL2324218
SMILES [#7]\[#6](-[#7])=[#7]/[#6]-[#6]-[#6]-[#6@H](-[#7]-[#6](=O)-[#6@H](-[#6]-[#6](=O)-[#7]-[#8])-[#6]-c1ccc2ccccc2c1)-[#6](=O)-[#8]-[#6]-[#6]=[#6]
InChI Key InChIKey=RGXAXYLGCICSGR-PMACEKPBSA-N
Data  1 KI
  Tab Delimited (TSV)   2D SDfile   Computed 3D by Vconf -m prep SDfile
Find this compound or compounds like it in BindingDB:
Activity Spreadsheet -- Enzyme Inhibition Constant Data from BindingDB
Found 1 hit for monomerid = 50427704
TargetInsulin-degrading enzyme(Homo sapiens (Human))
Mayo Clinic
Curated by ChEMBL
LigandPNGBDBM50427704(CHEMBL2324218)
Affinity DataKi:  5.28E+3nM. Assay description: Inhibition of human recombinant IDE-mediated FRET1 degradation
In DepthDetails ArticlePubMed