BDBM50427729 CHEMBL2324533
SMILES CNC(=O)\C=C1\COc2c1ccc(OS(=O)(=O)c1ccccc1)c2C
InChI Key InChIKey=DQJCQLCXPRMXEO-RAXLEYEMSA-N
Data  1 IC50
  Tab Delimited (TSV)   2D SDfile   Computed 3D by Vconf -m prep SDfile
Find this compound or compounds like it in BindingDB:
Activity Spreadsheet -- Enzyme Inhibition Constant Data from BindingDB
Found 1 hit for monomerid = 50427729
TargetAmine oxidase [flavin-containing] A(Rattus norvegicus (rat))
Universit£
Curated by ChEMBL
LigandPNGBDBM50427729(CHEMBL2324533)
Affinity DataIC50:  9.80nM. Assay description: Inhibition of MAO-A in Sprague-Dawley rat brain mitochondrial suspension using kynuramine as substrate incubated for 5 mins prior to substrate additi...
In DepthDetails ArticlePubMed