BDBM50428278 CHEMBL446306
SMILES CCCCP(O)(=O)C1=C[C@@H](N)CC1
InChI Key InChIKey=NMRMMIXNZXGFKG-QMMMGPOBSA-N
Data  1 IC50
  Tab Delimited (TSV)   2D SDfile   Computed 3D by Vconf -m prep SDfile
Find this compound or compounds like it in BindingDB:
Activity Spreadsheet -- Enzyme Inhibition Constant Data from BindingDB
Found 1 hit for monomerid = 50428278
TargetGamma-aminobutyric acid receptor subunit rho-1(Homo sapiens (Human))
The University Of Sydney
Curated by ChEMBL
LigandPNGBDBM50428278(CHEMBL446306)
Affinity DataIC50:  9.76E+3nM. Assay description: Antagonist activity at human GABAC rho1 receptor expressed in Xenopus laevis oocytes assessed as inhibition of GABA-induced current by two electrode ...
In DepthDetails ArticlePubMed