BDBM50428980 CHEMBL491082
SMILES O=C(Nc1ccccc1-c1cn2c(CN3CCNCC3)csc2n1)c1cnc2ccccc2c1
InChI Key InChIKey=HUPWJKZBMGOXCR-UHFFFAOYSA-N
Data  1 EC50
  Tab Delimited (TSV)   2D SDfile   Computed 3D by Vconf -m prep SDfile
Find this compound or compounds like it in BindingDB:
Activity Spreadsheet -- Enzyme Inhibition Constant Data from BindingDB
Found 1 hit for monomerid = 50428980
TargetNAD-dependent protein deacetylase sirtuin-1(Homo sapiens (Human))
Chinese Academy Of Sciences
Curated by ChEMBL
LigandPNGBDBM50428980(CHEMBL491082)
Affinity DataEC50:  680nM. Assay description: Activation of N-terminal His6-tagged SIRT1 (156 to 664 amino acid residues) (unknown origin) expressed in Escherichia coli BL21(DE3) using ac-RHKKac-...
In DepthDetails ArticlePubMed