BDBM50429092 CHEMBL2335785
SMILES CS(=O)(=O)Nc1cccc2c(O)cc(nc12)C(=O)Nc1cccc(F)c1O
InChI Key InChIKey=NYWABVWSBQZVDY-UHFFFAOYSA-N
Data  1 IC50
  Tab Delimited (TSV)   2D SDfile   Computed 3D by Vconf -m prep SDfile
Find this compound or compounds like it in BindingDB:
Activity Spreadsheet -- Enzyme Inhibition Constant Data from BindingDB
Found 1 hit for monomerid = 50429092
TargetPlatelet-activating factor acetylhydrolase(Homo sapiens (Human))
Activx Biosciences
Curated by ChEMBL
LigandPNGBDBM50429092(CHEMBL2335785)
Affinity DataIC50:  80nM. Assay description: Inhibition of human plasma Lp-PLA2 using 2- thio-PAF as substrate incubated for 20 mins prior to substrate addition measured after 1 hr
In DepthDetails ArticlePubMed