BDBM50429220 CHEMBL2332255
SMILES CN(C(=O)Cn1c2cc(cc3CCCCn(c23)c1=O)-c1ccccc1)c1ccccc1
InChI Key InChIKey=WXJDHNRXIVLCHB-UHFFFAOYSA-N
Data  1 KI
  Tab Delimited (TSV)   2D SDfile   Computed 3D by Vconf -m prep SDfile
Find this compound or compounds like it in BindingDB:
Activity Spreadsheet -- Enzyme Inhibition Constant Data from BindingDB
Found 1 hit for monomerid = 50429220
TargetTranslocator protein(Rattus norvegicus (rat))
Dainippon Sumitomo Pharma
Curated by ChEMBL
LigandPNGBDBM50429220(CHEMBL2332255)
Affinity DataKi:  0.320nM. Assay description: Displacement of [3H]PK11195 from TSPO in Sprague-Dawley rat kidney mitochondria after 1 hr by liquid scintillation counting analysis
In DepthDetails ArticlePubMed