BDBM50429300 CHEMBL2334146
SMILES Cc1c(Cl)cccc1C(=O)N1CCC[C@@H](C1)c1nc(no1)-c1cccc(Br)c1
InChI Key InChIKey=AERFENLNWRADTM-HNNXBMFYSA-N
Data  1 IC50
  Tab Delimited (TSV)   2D SDfile   Computed 3D by Vconf -m prep SDfile
Find this compound or compounds like it in BindingDB:
Activity Spreadsheet -- Enzyme Inhibition Constant Data from BindingDB
Found 1 hit for monomerid = 50429300
Target11-beta-hydroxysteroid dehydrogenase 1(Homo sapiens (Human))
Chinese Academy Of Sciences
Curated by ChEMBL
LigandPNGBDBM50429300(CHEMBL2334146)
Affinity DataIC50:  310nM. Assay description: Inhibition of human 11-beta HSD1 transfected in HEK293 cell microsomes assessed as decrease in [3H]cortisol generation using [3H]cortisone as substra...
In DepthDetails ArticlePubMed