BDBM50430539 CHEMBL2336903
SMILES CC(C)(C)c1ccc(Nc2nnc(-c3cccc(c3)S(N)(=O)=O)c3ccccc23)cc1
InChI Key InChIKey=KKMBIRFSXYZYDA-UHFFFAOYSA-N
Data  3 IC50
  Tab Delimited (TSV)   2D SDfile   Computed 3D by Vconf -m prep SDfile
Find this compound or compounds like it in BindingDB:
Activity Spreadsheet -- Enzyme Inhibition Constant Data from BindingDB
Found 3 hits for monomerid = 50430539
TargetCarbonic anhydrase 2(Homo sapiens (Human))
East China University Of Science And Technology
Curated by ChEMBL
LigandPNGBDBM50430539(CHEMBL2336903)
Affinity DataIC50: >1.00E+4nM. Assay description: Inhibition of recombinant human carbonic anhydrase 2 after 15 mins by stopped flow CO2 hydration assay
In DepthDetails ArticlePubMed
TargetCarbonic anhydrase 9(Homo sapiens (Human))
East China University Of Science And Technology
Curated by ChEMBL
LigandPNGBDBM50430539(CHEMBL2336903)
Affinity DataIC50:  29nM. Assay description: Inhibition of recombinant human carbonic anhydrase 9 after 15 mins by stopped flow CO2 hydration assay
In DepthDetails ArticlePubMed
TargetCarbonic anhydrase 1(Homo sapiens (Human))
East China University Of Science And Technology
Curated by ChEMBL
LigandPNGBDBM50430539(CHEMBL2336903)
Affinity DataIC50: >1.00E+4nM. Assay description: Inhibition of recombinant human carbonic anhydrase 1 after 15 mins by stopped flow CO2 hydration assay
In DepthDetails ArticlePubMed