BDBM50431036 CHEMBL2338760
SMILES CCCCCc1ccc2N[C@H](C3CCCCC3)[C@@H]3CCCO[C@@H]3c2c1
InChI Key InChIKey=ZNNNHMQVUHNXQO-PMOQBDJRSA-N
Data  2 KI
  Tab Delimited (TSV)   2D SDfile   Computed 3D by Vconf -m prep SDfile
Find this compound or compounds like it in BindingDB:
Activity Spreadsheet -- Enzyme Inhibition Constant Data from BindingDB
Found 2 hits for monomerid = 50431036
TargetSigma non-opioid intracellular receptor 1(Homo sapiens (Human))
Esteve
Curated by ChEMBL
LigandPNGBDBM50431036(CHEMBL2338760)
Affinity DataKi:  19nM. Assay description: Displacement of [3H]-(+)-pentazocine from human sigma1 receptor transfected in HEK293 cells after 120 mins by liquid scintillation counting analysis
In DepthDetails ArticlePubMed
TargetSigma non-opioid intracellular receptor 1(Homo sapiens (Human))
Esteve
Curated by ChEMBL
LigandPNGBDBM50431036(CHEMBL2338760)
Affinity DataKi:  19nM. Assay description: Displacement of [3H]-(+)-pentazocine from human sigma1 receptor transfected in HEK293 cells after 120 mins by liquid scintillation counting analysis
In DepthDetails ArticlePubMed