BDBM50431805 CHEMBL2347043
SMILES CCCCCCCC\C=C/CCCCCCCCNC(=O)c1cc(-c2ccccc2)n(n1)-c1ccccc1
InChI Key InChIKey=UBUPXEKWNRMJAE-KTKRTIGZSA-N
Data  2 KI
  Tab Delimited (TSV)   2D SDfile   Computed 3D by Vconf -m prep SDfile
Find this compound or compounds like it in BindingDB:
Activity Spreadsheet -- Enzyme Inhibition Constant Data from BindingDB
Found 2 hits for monomerid = 50431805
TargetCannabinoid receptor 1(Homo sapiens (Human))
Instituto De Qu£Mica M£Dica
Curated by ChEMBL
LigandPNGBDBM50431805(CHEMBL2347043)
Affinity DataKi: >4.00E+4nM. Assay description: Displacement of [3H]-CP55940 from human CB1 receptor after 90 mins by liquid scintillation spectrophotometer analysis
In DepthDetails ArticlePubMed
TargetCannabinoid receptor 2(Homo sapiens (Human))
Instituto De Qu£Mica M£Dica
Curated by ChEMBL
LigandPNGBDBM50431805(CHEMBL2347043)
Affinity DataKi: >4.00E+4nM. Assay description: Displacement of [3H]-CP55940 from human CB2 receptor after 90 mins by liquid scintillation spectrophotometer analysis
In DepthDetails ArticlePubMed