BDBM50432393 CHEMBL2348571
SMILES Cc1ncc(n1CCSc1nnc(o1)-c1ccc(C)cc1)[N+]([O-])=O
InChI Key InChIKey=FCJDAJXTEJXFSI-UHFFFAOYSA-N
Data  1 IC50
  Tab Delimited (TSV)   2D SDfile   Computed 3D by Vconf -m prep SDfile
Find this compound or compounds like it in BindingDB:
Activity Spreadsheet -- Enzyme Inhibition Constant Data from BindingDB
Found 1 hit for monomerid = 50432393
TargetThymidylate synthase(Homo sapiens (Human))
Nanjing University
Curated by ChEMBL
LigandPNGBDBM50432393(CHEMBL2348571)
Affinity DataIC50:  2.10E+3nM. Assay description: Inhibition of human thymidylate synthase by spectrophotometric analysis
In DepthDetails ArticlePubMed