BDBM50432479 CHEMBL2349357
SMILES O=C(CCc1ccccc1)Nc1cc(ccc1NS(=O)(=O)c1cccs1)-c1csc(=O)[nH]1
InChI Key InChIKey=JGUWUSHPXXKDQU-UHFFFAOYSA-N
Data  1 IC50
  Tab Delimited (TSV)   2D SDfile   Computed 3D by Vconf -m prep SDfile
Find this compound or compounds like it in BindingDB:
Activity Spreadsheet -- Enzyme Inhibition Constant Data from BindingDB
Found 1 hit for monomerid = 50432479
TargetBromodomain-containing protein 4(Homo sapiens (Human))
Chinese Academy Of Sciences
Curated by ChEMBL
LigandPNGBDBM50432479(CHEMBL2349357)
Affinity DataIC50:  2.60E+3nM. Assay description: Displacement of FITC-labeled (+)-JQ1 from bromodomain BRD4(1) (unknown origin) expressed in Escherichia coli BL21(DE3) after 4 hrs by fluorescence an...
In DepthDetails ArticlePubMed