BDBM50432642 CHEMBL2059299
SMILES OC(=O)C[C@@H]1C[C@H]([C@H](N(CC2CC2)C1=O)c1ccc(Cl)cc1)c1cccc(Cl)c1
InChI Key InChIKey=OMAPWASVHLHIRY-RBDMOPTHSA-N
Data  2 IC50
  Tab Delimited (TSV)   2D SDfile   Computed 3D by Vconf -m prep SDfile
Find this compound or compounds like it in BindingDB:
Activity Spreadsheet -- Enzyme Inhibition Constant Data from BindingDB
Found 2 hits for monomerid = 50432642
TargetE3 ubiquitin-protein ligase Mdm2(Homo sapiens (Human))
Amgen
Curated by ChEMBL
LigandPNGBDBM50432642(CHEMBL2059299)
Affinity DataIC50:  2.40E+3nM. Assay description: Inhibition of human recombinant GST-thrombin-MDM2 (1 to 188) expressed in Escherichia coli assessed as reduction of MDM2-p53 interaction incubated fo...
In DepthDetails ArticlePubMed
TargetE3 ubiquitin-protein ligase Mdm2(Homo sapiens (Human))
Amgen
Curated by ChEMBL
LigandPNGBDBM50432642(CHEMBL2059299)
Affinity DataIC50:  1.89E+4nM. Assay description: Inhibition of human recombinant GST-thrombin-MDM2 (1 to 188) expressed in Escherichia coli assessed as reduction of MDM2-p53 interaction incubated fo...
In DepthDetails ArticlePubMed