BDBM50432647 CHEMBL2347387::US11407721, Example 14 Step A
SMILES Clc1ccc(cc1)[C@@H]1[C@@H](O[C@@H](CC=C)C(=O)N1CC1CC1)c1cccc(Cl)c1
InChI Key InChIKey=GYOAZTPSRBBAKY-BDTNDASRSA-N
Data  4 IC50
  Tab Delimited (TSV)   2D SDfile   Computed 3D by Vconf -m prep SDfile
Find this compound or compounds like it in BindingDB:
Activity Spreadsheet -- Enzyme Inhibition Constant Data from BindingDB
Found 4 hits for monomerid = 50432647
TargetE3 ubiquitin-protein ligase Mdm2(Homo sapiens (Human))
Amgen
Curated by ChEMBL
LigandPNGBDBM50432647(CHEMBL2347387 | US11407721, Example 14 Step A)
Affinity DataIC50: >3.00E+4nM. Assay description: Inhibition of human recombinant GST-thrombin-MDM2 (1 to 188) expressed in Escherichia coli assessed as reduction of MDM2-p53 interaction incubated fo...
In DepthDetails ArticlePubMed
TargetE3 ubiquitin-protein ligase Mdm2 [1-188](Homo sapiens (Human))
Amgen
US Patent
LigandPNGBDBM50432647(CHEMBL2347387 | US11407721, Example 14 Step A)
Affinity DataIC50:  5.10E+4nM. Assay description: This assay was run using the same conditions as the HTRF1 assay except that 20 uL of GST-hMDM2 was incubated with 1.0 ul of diluted compound.
In DepthDetails US Patent
TargetE3 ubiquitin-protein ligase Mdm2 [1-188](Homo sapiens (Human))
Amgen
US Patent
LigandPNGBDBM50432647(CHEMBL2347387 | US11407721, Example 14 Step A)
Affinity DataIC50:  1.34E+3nM. Assay description: The standard assay conditions for the in vitro HTRF assay consisted of a 50 ul total reaction volume in black 384-well Costar polypropylene plates in...
In DepthDetails US Patent
TargetE3 ubiquitin-protein ligase Mdm2(Homo sapiens (Human))
Amgen
Curated by ChEMBL
LigandPNGBDBM50432647(CHEMBL2347387 | US11407721, Example 14 Step A)
Affinity DataIC50:  1.40E+3nM. Assay description: Inhibition of human recombinant GST-thrombin-MDM2 (1 to 188) expressed in Escherichia coli assessed as reduction of MDM2-p53 interaction incubated fo...
In DepthDetails ArticlePubMed