BDBM50433530 CHEMBL2381382
SMILES CC(C)n1nc(N)nc1-c1nc-2c(CCOc3cc(ccc-23)-c2cnn(CCO)c2)s1
InChI Key InChIKey=JYBBRWIADLMZMN-UHFFFAOYSA-N
Data  1 KI  2 IC50
  Tab Delimited (TSV)   2D SDfile   Computed 3D by Vconf -m prep SDfile
Find this compound or compounds like it in BindingDB:
Activity Spreadsheet -- Enzyme Inhibition Constant Data from BindingDB
Found 3 hits for monomerid = 50433530
LigandPNGBDBM50433530(CHEMBL2381382)
Affinity DataKi:  0.0400nM. Assay description: Inhibition of GST-fused human recombinant PI3Kalpha expressed in baculovirus infected SF9 cells after 1 hr by scintillation proximity assay in presen...
In DepthDetails ArticlePubMed
LigandPNGBDBM50433530(CHEMBL2381382)
Affinity DataIC50:  1.80nM. Assay description: Inhibition of GST-fused human recombinant PI3Kbeta expressed in baculovirus infected SF9 cells after 1 hr by scintillation proximity assay in presenc...
In DepthDetails ArticlePubMed
LigandPNGBDBM50433530(CHEMBL2381382)
Affinity DataIC50:  38nM. Assay description: Inhibition of PI3Kalpha in human PC3 cells assessed as inhibition of AKT phosphorylation at Ser473 after 2 hrs by ELISA
In DepthDetails ArticlePubMed