BDBM50434539 CHEMBL2386183
SMILES Cc1ccc(s1)[B-]1([NH2+]CCO1)c1ccccc1
InChI Key InChIKey=GHYBLWLPZXHEBK-UHFFFAOYSA-N
Data  2 IC50
  Tab Delimited (TSV)   2D SDfile   Computed 3D by Vconf -m prep SDfile
Find this compound or compounds like it in BindingDB:
Activity Spreadsheet -- Enzyme Inhibition Constant Data from BindingDB
Found 2 hits for monomerid = 50434539
TargetTransient receptor potential cation channel subfamily V member 6(Homo sapiens (Human))
University Of Bern
Curated by ChEMBL
LigandPNGBDBM50434539(CHEMBL2386183)
Affinity DataIC50:  1.23E+4nM. Assay description: Inhibition of human TRPV6 transfected in HEK293 cells assessed as inhibition of Ca2+ influx after 5 mins by FLIPR assay
In DepthDetails ArticlePubMed
TargetTransient receptor potential cation channel subfamily V member 6(Homo sapiens (Human))
University Of Bern
Curated by ChEMBL
LigandPNGBDBM50434539(CHEMBL2386183)
Affinity DataIC50:  1.00E+4nM. Assay description: Inhibition of human TRPV6 transfected in HEK293 cells assessed as inhibition of Cd2+ influx after 5 mins by FLIPR assay
In DepthDetails ArticlePubMed