BDBM50434759 CHEMBL2385588
SMILES Clc1cc(ccn1)-c1cnn2cc(cnc12)-c1ccc(cc1)N1CCNCC1
InChI Key InChIKey=HYXWNQUIORDRPW-UHFFFAOYSA-N
Data  1 IC50
  Tab Delimited (TSV)   2D SDfile   Computed 3D by Vconf -m prep SDfile
Find this compound or compounds like it in BindingDB:
Activity Spreadsheet -- Enzyme Inhibition Constant Data from BindingDB
Found 1 hit for monomerid = 50434759
TargetBone morphogenetic protein 4(Mus musculus)
Vanderbilt University Medical Center
Curated by ChEMBL
LigandPNGBDBM50434759(CHEMBL2385588)
Affinity DataIC50:  246nM. Assay description: Inhibition of BMP4 in mouse C2C12BRA cells after 14 hrs by luciferase reporter gene assay
In DepthDetails ArticlePubMed