BDBM50437644 CHEMBL2407880
SMILES CCN(CC)c1ncc(N(C)S(C)(=O)=O)c(N[C@@H](Cc2ccc(OC(=O)N3CCCC3)cc2)C(O)=O)n1
InChI Key InChIKey=DFGIRJIXSZXHRL-IBGZPJMESA-N
Data  3 IC50
  Tab Delimited (TSV)   2D SDfile   Computed 3D by Vconf -m prep SDfile
Find this compound or compounds like it in BindingDB:
Activity Spreadsheet -- Enzyme Inhibition Constant Data from BindingDB
Found 3 hits for monomerid = 50437644
TargetIntegrin alpha-4/beta-1(Homo sapiens (Human))
Elan Pharmaceuticals
Curated by ChEMBL
LigandPNGBDBM50437644(CHEMBL2407880)
Affinity DataIC50:  1.75E+4nM. Assay description: Inhibition of alpha4beta1 integrin-mediated human jurkat cell adhesion to fibronectin in presence of human serum albumin
In DepthDetails ArticlePubMed
TargetIntegrin alpha-4/beta-1(Homo sapiens (Human))
Elan Pharmaceuticals
Curated by ChEMBL
LigandPNGBDBM50437644(CHEMBL2407880)
Affinity DataIC50:  27nM. Assay description: Inhibition of alpha4beta1 integrin-mediated human jurkat cell adhesion to fibronectin in absence of human serum albumin
In DepthDetails ArticlePubMed
TargetIntegrin alpha-4/beta-7(Homo sapiens (Human))
Elan Pharmaceuticals
Curated by ChEMBL
LigandPNGBDBM50437644(CHEMBL2407880)
Affinity DataIC50:  179nM. Assay description: Inhibition of alpha4beta7 integrin-mediated human 8866 cell adhesion to MadCAM-1
In DepthDetails ArticlePubMed