BDBM50437651 CHEMBL2408068
SMILES CCN(CC)c1ncc(N(CC)C(=O)NCc2ccccc2)c(N[C@@H](Cc2ccc(OC(=O)N3CCCC3)cc2)C(O)=O)n1
InChI Key InChIKey=JVVBWVZYFIVRCL-SANMLTNESA-N
Data  3 IC50
  Tab Delimited (TSV)   2D SDfile   Computed 3D by Vconf -m prep SDfile
Find this compound or compounds like it in BindingDB:
Activity Spreadsheet -- Enzyme Inhibition Constant Data from BindingDB
Found 3 hits for monomerid = 50437651
TargetIntegrin alpha-4/beta-1(Homo sapiens (Human))
Elan Pharmaceuticals
Curated by ChEMBL
LigandPNGBDBM50437651(CHEMBL2408068)
Affinity DataIC50:  7.15E+3nM. Assay description: Inhibition of alpha4beta1 integrin-mediated human jurkat cell adhesion to fibronectin in presence of human serum albumin
In DepthDetails ArticlePubMed
TargetIntegrin alpha-4/beta-1(Homo sapiens (Human))
Elan Pharmaceuticals
Curated by ChEMBL
LigandPNGBDBM50437651(CHEMBL2408068)
Affinity DataIC50:  19nM. Assay description: Inhibition of alpha4beta1 integrin-mediated human jurkat cell adhesion to fibronectin in absence of human serum albumin
In DepthDetails ArticlePubMed
TargetIntegrin alpha-4/beta-7(Homo sapiens (Human))
Elan Pharmaceuticals
Curated by ChEMBL
LigandPNGBDBM50437651(CHEMBL2408068)
Affinity DataIC50:  174nM. Assay description: Inhibition of alpha4beta7 integrin-mediated human 8866 cell adhesion to MadCAM-1
In DepthDetails ArticlePubMed