BDBM50437667 CHEMBL2408064
SMILES CCN(CC)C(=O)N(CC)c1cnc(nc1N[C@@H](Cc1ccc(OC(=O)N2CCCC2)cc1)C(O)=O)N(CC)CC
InChI Key InChIKey=RROLERMMZPCBCQ-QHCPKHFHSA-N
Data  2 IC50
  Tab Delimited (TSV)   2D SDfile   Computed 3D by Vconf -m prep SDfile
Find this compound or compounds like it in BindingDB:
Activity Spreadsheet -- Enzyme Inhibition Constant Data from BindingDB
Found 2 hits for monomerid = 50437667
TargetIntegrin alpha-4/beta-7(Homo sapiens (Human))
Elan Pharmaceuticals
Curated by ChEMBL
LigandPNGBDBM50437667(CHEMBL2408064)
Affinity DataIC50:  6nM. Assay description: Inhibition of alpha4beta7 integrin-mediated human 8866 cell adhesion to MadCAM-1
In DepthDetails ArticlePubMed
TargetIntegrin alpha-4/beta-1(Homo sapiens (Human))
Elan Pharmaceuticals
Curated by ChEMBL
LigandPNGBDBM50437667(CHEMBL2408064)
Affinity DataIC50:  1.05E+3nM. Assay description: Inhibition of alpha4beta1 integrin-mediated human jurkat cell adhesion to fibronectin in presence of human serum albumin
In DepthDetails ArticlePubMed