BDBM50437998 CHEMBL2409456
SMILES CCOC(=O)c1nn(C(=O)c2cccc(C)c2)c2ccc(cc12)[N+]([O-])=O
InChI Key InChIKey=XCGFGRFEADLGDR-UHFFFAOYSA-N
Data  2 IC50
  Tab Delimited (TSV)   2D SDfile   Computed 3D by Vconf -m prep SDfile
Find this compound or compounds like it in BindingDB:
Activity Spreadsheet -- Enzyme Inhibition Constant Data from BindingDB
Found 2 hits for monomerid = 50437998
TargetNeutrophil elastase(Homo sapiens (Human))
Universit£
Curated by ChEMBL
LigandPNGBDBM50437998(CHEMBL2409456)
Affinity DataIC50:  20nM. Assay description: Inhibition of human neutrophil elastase using N-methylsuccinyl-Ala-Ala-Pro-Val-7-amino-4-methylcoumarin as substrate measured every 30 seconds for 10...
In DepthDetails ArticlePubMed
TargetChymotrypsinogen B(Homo sapiens (Human))
Universit£
Curated by ChEMBL
LigandPNGBDBM50437998(CHEMBL2409456)
Affinity DataIC50:  40nM. Assay description: Inhibition of human pancreatic chymotrypsin using Suc-Ala-Ala-Pro-7-amino-4-methylcoumarin as substrate by fluorescence microplate reader analysis
In DepthDetails ArticlePubMed