BDBM50438797 CHEMBL336340
SMILES OC(=O)Cn1ccc(c1)C(=O)c1ccc(cc1)-c1ccccc1
InChI Key InChIKey=WPNZSINOTOQKAF-UHFFFAOYSA-N
Data  1 IC50
  Tab Delimited (TSV)   2D SDfile   Computed 3D by Vconf -m prep SDfile
Find this compound or compounds like it in BindingDB:
Activity Spreadsheet -- Enzyme Inhibition Constant Data from BindingDB
Found 1 hit for monomerid = 50438797
TargetAldo-keto reductase family 1 member B1(Rattus norvegicus)
Aristotle University Of Thessaloniki
Curated by ChEMBL
LigandPNGBDBM50438797(CHEMBL336340)
Affinity DataIC50:  5.25E+4nM. Assay description: Inhibition of partially purified Fischer-344 rat kidney ALR1 using D,L-glycuronate as substrate assessed as NADPH consumption by spectrophotometry
In DepthDetails ArticlePubMed