BDBM50439435 CHEMBL2420700
SMILES Cn1cc(c(n1)-c1ccc(F)cc1)-c1ccncc1
InChI Key InChIKey=DSFLBGZXRVTGEA-UHFFFAOYSA-N
Data  3 IC50
  Tab Delimited (TSV)   2D SDfile   Computed 3D by Vconf -m prep SDfile
Find this compound or compounds like it in BindingDB:
Activity Spreadsheet -- Enzyme Inhibition Constant Data from BindingDB
Found 3 hits for monomerid = 50439435
TargetCasein kinase I isoform delta(Homo sapiens (Human))
Pfizer
Curated by ChEMBL
LigandPNGBDBM50439435(CHEMBL2420700)
Affinity DataIC50:  545nM. Assay description: Inhibition of human CK1 delta transfected in african green monkey cos7 cells after overnight incubation by whole cell assay
In DepthDetails ArticlePubMed
TargetCasein kinase I isoform delta(Homo sapiens (Human))
Pfizer
Curated by ChEMBL
LigandPNGBDBM50439435(CHEMBL2420700)
Affinity DataIC50:  48nM. Assay description: Inhibition of CK1 delta (unknown origin) using PLSRTLpSVASLPGL as substrate after 60 mins by microplate reader analysis
In DepthDetails ArticlePubMed
TargetCasein kinase I isoform epsilon(Homo sapiens (Human))
Pfizer
Curated by ChEMBL
LigandPNGBDBM50439435(CHEMBL2420700)
Affinity DataIC50:  305nM. Assay description: Inhibition of CK1 epsilon (unknown origin) using PLSRTLpSVASLPGL as substrate after 85 mins by microplate reader analysis
In DepthDetails ArticlePubMed