BDBM50439798 CHEMBL2419699::US9181266, 38
SMILES Fc1ccc(cc1)C(=O)C1CCN(CC(=O)N(Cc2ccccc2)Cc2nc3CCOCc3c(=O)[nH]2)CC1
InChI Key InChIKey=JDRRUNIVJVAXBH-UHFFFAOYSA-N
Data  7 IC50
  Tab Delimited (TSV)   2D SDfile   Computed 3D by Vconf -m prep SDfile
Find this compound or compounds like it in BindingDB:
Activity Spreadsheet -- Enzyme Inhibition Constant Data from BindingDB
Found 4 hits for monomerid = 50439798
TargetPoly [ADP-ribose] polymerase tankyrase-1(Homo sapiens (Human))
Novartis
US Patent
LigandPNGBDBM50439798(CHEMBL2419699 | US9181266, 38)
Affinity DataIC50:  82nMT: 2°C. Assay description: The autoparsylation activity of the TNKS 1/2 or PARP1/2 enzymes was measured by the liquid chromatography-mass spectrometry (LC/MS) detection of nico...
In DepthDetails US Patent
TargetPoly [ADP-ribose] polymerase tankyrase-2(Homo sapiens (Human))
Novartis
US Patent
LigandPNGBDBM50439798(CHEMBL2419699 | US9181266, 38)
Affinity DataIC50:  16nMT: 2°C. Assay description: The autoparsylation activity of the TNKS 1/2 or PARP1/2 enzymes was measured by the liquid chromatography-mass spectrometry (LC/MS) detection of nico...
In DepthDetails US Patent
TargetPoly [ADP-ribose] polymerase 1(Homo sapiens (Human))
Novartis
US Patent
LigandPNGBDBM50439798(CHEMBL2419699 | US9181266, 38)
Affinity DataIC50: >1.90E+4nMT: 2°C. Assay description: The autoparsylation activity of the TNKS 1/2 or PARP1/2 enzymes was measured by the liquid chromatography-mass spectrometry (LC/MS) detection of nico...
In DepthDetails US Patent
TargetPoly [ADP-ribose] polymerase 2(Homo sapiens (Human))
Novartis
US Patent
LigandPNGBDBM50439798(CHEMBL2419699 | US9181266, 38)
Affinity DataIC50: >1.90E+4nMT: 2°C. Assay description: The autoparsylation activity of the TNKS 1/2 or PARP1/2 enzymes was measured by the liquid chromatography-mass spectrometry (LC/MS) detection of nico...
In DepthDetails US Patent