BDBM50440483 CHEMBL2426040
SMILES CC(C)(C)OC(=O)[C@H](CCCCNCC#C)NC(=O)c1ccccc1
InChI Key InChIKey=KMFIKMBQNRIOGM-KRWDZBQOSA-N
Data  1 IC50
  Tab Delimited (TSV)   2D SDfile   Computed 3D by Vconf -m prep SDfile
Find this compound or compounds like it in BindingDB:
Activity Spreadsheet -- Enzyme Inhibition Constant Data from BindingDB
Found 1 hit for monomerid = 50440483
TargetLysine-specific histone demethylase 1A(Homo sapiens (Human))
University Of Freiburg
Curated by ChEMBL
LigandPNGBDBM50440483(CHEMBL2426040)
Affinity DataIC50:  1.44E+5nM. Assay description: Inhibition of LSD1 (unknown origin) expressed in Sf9 cells using H3K4(me2) as substrate preincubated for 30 mins prior to substrate addition measured...
In DepthDetails ArticlePubMed