BDBM50440553 CHEMBL2426356
SMILES CC(C)[C@@]1(CC[C@H](C1)NC1CCc2ccc(C)cc12)C(=O)NCc1cc(cc(c1)C(F)(F)F)C(F)(F)F
InChI Key InChIKey=CYOPVJNXOHCGAT-OVQDZVAUSA-N
Data  1 KI
  Tab Delimited (TSV)   2D SDfile   Computed 3D by Vconf -m prep SDfile
Find this compound or compounds like it in BindingDB:
Activity Spreadsheet -- Enzyme Inhibition Constant Data from BindingDB
Found 1 hit for monomerid = 50440553
TargetC-C motif chemokine 2(Homo sapiens (Human))
Leiden University
Curated by ChEMBL
LigandPNGBDBM50440553(CHEMBL2426356)
Affinity DataKi:  55nM. Assay description: Displacement of [125I]-CCL2 from human CCR2 receptor expressed in human U2OS cell membranes
In DepthDetails ArticlePubMed