BDBM50441118 CHEMBL2430734
SMILES COc1ccc(cc1-c1cnc(N)c(N[C@H](C)c2ccccc2)n1)C(O)=O
InChI Key InChIKey=IPPCFMZAQYUQPP-GFCCVEGCSA-N
Data  2 IC50  1 Kd
  Tab Delimited (TSV)   2D SDfile   Computed 3D by Vconf -m prep SDfile
Find this compound or compounds like it in BindingDB:
Activity Spreadsheet -- Enzyme Inhibition Constant Data from BindingDB
Found 3 hits for monomerid = 50441118
TargetL-lactate dehydrogenase B chain(Homo sapiens (Human))
Genentech
Curated by ChEMBL
LigandPNGBDBM50441118(CHEMBL2430734)
Affinity DataIC50:  7.00E+3nM. Assay description: Inhibition of human recombinant carboxy-terminal his-tagged LDHB (1 to 333) expressed in Escherichia coli using pyruvate as substrate assessed as dis...
In DepthDetails ArticlePubMed
TargetL-lactate dehydrogenase A chain(Homo sapiens (Human))
Genentech
Curated by ChEMBL
LigandPNGBDBM50441118(CHEMBL2430734)
Affinity DataIC50:  2.00E+3nM. Assay description: Inhibition of human recombinant carboxy-terminal his-tagged LDHA (1 to 331) expressed in Escherichia coli using pyruvate as substrate assessed as dis...
In DepthDetails ArticlePubMed
TargetL-lactate dehydrogenase A chain(Homo sapiens (Human))
Genentech
Curated by ChEMBL
LigandPNGBDBM50441118(CHEMBL2430734)
Affinity DataKd:  3.00E+3nM. Assay description: Binding affinity to human recombinant carboxy-terminal his-tagged LDHA (1 to 331) expressed in Escherichia coli by surface plasmon resonance analysis...
In DepthDetails ArticlePubMed