BDBM50442803 CHEMBL2440453
SMILES CC(O)CCN1CCC(CNC(=O)c2c3OCCCn3c3ccccc23)CC1
InChI Key InChIKey=BHQIBLIRLOZADN-UHFFFAOYSA-N
Data  1 KI
  Tab Delimited (TSV)   2D SDfile   Computed 3D by Vconf -m prep SDfile
Find this compound or compounds like it in BindingDB:
Activity Spreadsheet -- Enzyme Inhibition Constant Data from BindingDB
Found 1 hit for monomerid = 50442803
Target5-hydroxytryptamine receptor 4(GUINEA PIG)
University Of Oslo
Curated by ChEMBL
LigandPNGBDBM50442803(CHEMBL2440453)
Affinity DataKi:  0.794nM. Assay description: Displacement of [125I]SB207710 from 5-HT4 receptor in guinea pig brain membranes
In DepthDetails ArticlePubMed